Information card for entry 2106111
Formula |
Rh2 Y3 |
Calculated formula |
Rh2 Y3 |
Title of publication |
The tetragonal crystal structure of R3 Rh2 compounds with R= Gd, Tb, Dy, Ho, Er, Y |
Authors of publication |
Moreau, J.M.; Parthe, E.; Paccard, D. |
Journal of publication |
Acta Crystallographica B (24,1968-38,1982) |
Year of publication |
1976 |
Journal volume |
32 |
Pages of publication |
1767 - 1771 |
a |
12.232 Å |
b |
12.232 Å |
c |
25.16 Å |
α |
90° |
β |
90° |
γ |
90° |
Cell volume |
3764.49 Å3 |
Number of distinct elements |
2 |
Space group number |
140 |
Hermann-Mauguin space group symbol |
I 4/m c m |
Hall space group symbol |
-I 4 2c |
Yes |
No |
No |