Information card for entry 2108748
Structure factors | 2108748.hkl |
Original IUCr paper | HTML |
Chemical name | Bis(2,2'-bipyridine)hemi(octamolybdate)cobaltate(II) |
Formula | C20 H16 Co Mo4 N4 O13 |
Calculated formula | C20 H16 Co Mo4 N4 O13 |
Title of publication | Concomitance of octamolybdate isomers in metastable crystal structures isolated using homoleptic Co^II^/Co^III^ complexes as structure-directing templates |
Authors of publication | Atencio, Reinaldo; Briceño, Alexander; Bruno-Colmenarez, Julia; Silva, Pedro; Rodríguez, Laura; Sosa, Eleida; Limones, Erick; Pacheco, Yesenia; Cáceres, Julio; Vielma, Joel |
Journal of publication | Acta Crystallographica Section B |
Year of publication | 2021 |
Journal volume | 77 |
Journal issue | 1 |
Pages of publication | 99 - 114 |
a | 10.053 ± 0.003 Å |
b | 16.408 ± 0.005 Å |
c | 15.749 ± 0.004 Å |
α | 90° |
β | 100.06 ± 0.02° |
γ | 90° |
Cell volume | 2557.9 ± 1.3 Å3 |
Cell temperature | 298 ± 2 K |
Ambient diffraction temperature | 298 ± 2 K |
Number of distinct elements | 6 |
Space group number | 14 |
Hermann-Mauguin space group symbol | P 1 21/n 1 |
Hall space group symbol | -P 2yn |
Residual factor for all reflections | 0.0641 |
Residual factor for significantly intense reflections | 0.0488 |
Weighted residual factors for significantly intense reflections | 0.1349 |
Weighted residual factors for all reflections included in the refinement | 0.1469 |
Goodness-of-fit parameter for all reflections included in the refinement | 1.024 |
Diffraction radiation wavelength | 0.71069 Å |
Diffraction radiation type | MoKα |