Information card for entry 2108879
Common name |
L-histidine |
Chemical name |
2-Amino-3-(1H-imidazol-4-yl)propanoic acid |
Formula |
C6 H9 N3 O2 |
Calculated formula |
C6 H9 N3 O2 |
SMILES |
[O-]C(=O)[C@@H]([NH3+])Cc1nc[nH]c1 |
Title of publication |
Accurate H-atom parameters for the two polymorphs of <small>L</small>-histidine at 5, 105 and 295K |
Authors of publication |
Novelli, Giulia; McMonagle, Charles J.; Kleemiss, Florian; Probert, Michael; Puschmann, Horst; Grabowsky, Simon; Maynard-Casely, Helen E.; McIntyre, Garry J.; Parsons, Simon |
Journal of publication |
Acta Crystallographica Section B |
Year of publication |
2021 |
Journal volume |
77 |
Journal issue |
5 |
a |
5.1498 ± 0.0002 Å |
b |
7.1902 ± 0.0002 Å |
c |
18.8503 ± 0.0006 Å |
α |
90° |
β |
90° |
γ |
90° |
Cell volume |
697.99 ± 0.04 Å3 |
Cell temperature |
5 K |
Ambient diffraction temperature |
5 K |
Number of distinct elements |
4 |
Space group number |
19 |
Hermann-Mauguin space group symbol |
P 21 21 21 |
Hall space group symbol |
P 2ac 2ab |
Residual factor for all reflections |
0.0715 |
Residual factor for significantly intense reflections |
0.0475 |
Weighted residual factors for significantly intense reflections |
0.0649 |
Weighted residual factors for all reflections included in the refinement |
0.0692 |
Goodness-of-fit parameter for all reflections included in the refinement |
1.153 |
Diffraction radiation probe |
neutron |
Diffraction radiation wavelength |
0.8 Å |
Diffraction radiation type |
neutron |
Yes |
No |
Yes |