Information card for entry 2108887
Formula |
C6 H9 N3 O2 |
Calculated formula |
C6 H9 N3 O2 |
SMILES |
[O-]C(=O)[C@@H]([NH3+])Cc1nc[nH]c1 |
Title of publication |
Accurate H-atom parameters for the two polymorphs of <small>L</small>-histidine at 5, 105 and 295K |
Authors of publication |
Novelli, Giulia; McMonagle, Charles J.; Kleemiss, Florian; Probert, Michael; Puschmann, Horst; Grabowsky, Simon; Maynard-Casely, Helen E.; McIntyre, Garry J.; Parsons, Simon |
Journal of publication |
Acta Crystallographica Section B |
Year of publication |
2021 |
Journal volume |
77 |
Journal issue |
5 |
a |
5.169 ± 0.0003 Å |
b |
7.343 ± 0.0005 Å |
c |
18.8317 ± 0.0013 Å |
α |
90° |
β |
90° |
γ |
90° |
Cell volume |
714.78 ± 0.08 Å3 |
Cell temperature |
295 K |
Ambient diffraction temperature |
295 K |
Number of distinct elements |
4 |
Space group number |
19 |
Hermann-Mauguin space group symbol |
P 21 21 21 |
Hall space group symbol |
P 2ac 2ab |
Residual factor for all reflections |
0.0388 |
Residual factor for significantly intense reflections |
0.0287 |
Weighted residual factors for significantly intense reflections |
0.0518 |
Weighted residual factors for all reflections included in the refinement |
0.0539 |
Goodness-of-fit parameter for all reflections included in the refinement |
1.1144 |
Diffraction radiation probe |
x-ray |
Diffraction radiation wavelength |
0.71073 Å |
Diffraction radiation type |
MoKα |
Yes |
No |
Yes |