Information card for entry 2108905
Structure factors | 2108905.hkl |
Original IUCr paper | HTML |
Formula | C31 H22 Cl4 Ni P S4 |
Calculated formula | C31 H22 Cl4 Ni P S4 |
Title of publication | Electronic structure of (MePh~3~P)~2~[Ni^II^(bdtCl~2~)~2~]·2(CH~3~)~2~SO and (MePh~3~P)[Ni^III^(bdtCl~2~)~2~] (bdtCl~2~ = 3,6-dichlorobenzene-1,2-dithiolate) |
Authors of publication | Adamko Koziskova, Julia; Chen, Yu-Sheng; Grass, Su-Yin; Chuang, Yu-Chun; Hsu, I-Jui; Wang, Yu; Lutz, Martin; Volkov, Anatoliy; Herich, Peter; Vénosová, Barbora; Jelemenská, Ingrid; Bučinský, Lukáš; Breza, Martin; Kožíšek, Jozef |
Journal of publication | Acta Crystallographica Section B |
Year of publication | 2021 |
Journal volume | 77 |
Journal issue | 6 |
Pages of publication | 919 - 929 |
a | 13.3664 ± 0.0001 Å |
b | 14.4849 ± 0.0001 Å |
c | 15.9712 ± 0.0001 Å |
α | 90° |
β | 93.054 ± 0.001° |
γ | 90° |
Cell volume | 3087.81 ± 0.04 Å3 |
Cell temperature | 100 ± 1 K |
Ambient diffraction temperature | 100 ± 1 K |
Number of distinct elements | 6 |
Space group number | 14 |
Hermann-Mauguin space group symbol | P 1 21/c 1 |
Hall space group symbol | -P 2ybc |
Residual factor for all reflections | 0.0492 |
Residual factor for significantly intense reflections | 0.0264 |
Weighted residual factors for significantly intense reflections | 0.0669 |
Weighted residual factors for all reflections included in the refinement | 0.0789 |
Goodness-of-fit parameter for all reflections included in the refinement | 1.026 |
Diffraction radiation probe | x-ray |
Diffraction radiation wavelength | 0.56083 Å |
Diffraction radiation type | AgKα |