Information card for entry 2200175
Chemical name |
3,7,7-Trimethyl-4-phenyl-4,7,8,9-tetrahydro-2H-pyrazolo[3,4-b]quinolin-5- (6H)-one |
Formula |
C19 H21 N3 O |
Calculated formula |
C19 H21 N3 O |
Title of publication |
3,7,7-Trimethyl-4-phenyl-4,7,8,9-tetrahydro-2<i>H</i>-pyrazolo[3,4-<i>b</i>]quinolin-5-(6<i>H</i>)-one |
Authors of publication |
Cannon, Debbie; Quesada, Antonio; Quiroga, Jairo; Mejía, Diana; Insuasty, Braulio; Abonia, Rodrigo; Cobo, Justo; Nogueras, Manuel; Sánchez, Adolfo; Low, John Nicolson |
Journal of publication |
Acta Crystallographica Section E |
Year of publication |
2001 |
Journal volume |
57 |
Journal issue |
2 |
Pages of publication |
o157 - o159 |
a |
10.087 ± 0.0005 Å |
b |
14.1978 ± 0.0005 Å |
c |
11.1928 ± 0.0008 Å |
α |
90° |
β |
96.034 ± 0.0014° |
γ |
90° |
Cell volume |
1594.08 ± 0.15 Å3 |
Cell temperature |
150 ± 1 K |
Ambient diffraction temperature |
150 ± 1 K |
Number of distinct elements |
4 |
Space group number |
14 |
Hermann-Mauguin space group symbol |
P 1 21/n 1 |
Hall space group symbol |
-P 2yn |
Residual factor for all reflections |
0.132 |
Residual factor for significantly intense reflections |
0.056 |
Weighted residual factors for all reflections included in the refinement |
0.148 |
Goodness-of-fit parameter for all reflections included in the refinement |
0.941 |
Diffraction radiation wavelength |
0.71073 Å |
Diffraction radiation type |
MoKα |
Yes |
No |
Yes |