Information card for entry 2200229
Chemical name |
Triaqua(1,10-phenanthroline-2,9-dicarboxylato)magnesium(II) dihydrate |
Formula |
C14 H16 Mg N2 O9 |
Calculated formula |
C14 H12 Mg N2 O9 |
Title of publication |
A magnesium(II) complex of 1,10-phenanthroline-2,9-dicarboxylate |
Authors of publication |
Park, Ki-Min; Yoon, Il; Seo, Joobeom; Lee, Yoon Hee; Lee, Shim Sung |
Journal of publication |
Acta Crystallographica Section E |
Year of publication |
2001 |
Journal volume |
57 |
Journal issue |
4 |
Pages of publication |
m154 - m156 |
a |
7.4194 ± 0.0012 Å |
b |
19.044 ± 0.003 Å |
c |
46.943 ± 0.007 Å |
α |
90° |
β |
90° |
γ |
90° |
Cell volume |
6632.8 ± 1.8 Å3 |
Cell temperature |
293 ± 2 K |
Ambient diffraction temperature |
293 ± 2 K |
Number of distinct elements |
5 |
Space group number |
70 |
Hermann-Mauguin space group symbol |
F d d d :2 |
Hall space group symbol |
-F 2uv 2vw |
Residual factor for all reflections |
0.085 |
Residual factor for significantly intense reflections |
0.055 |
Weighted residual factors for all reflections included in the refinement |
0.186 |
Goodness-of-fit parameter for all reflections included in the refinement |
1.059 |
Diffraction radiation wavelength |
0.71073 Å |
Diffraction radiation type |
MoKα |
Yes |
No |
Yes |