Information card for entry 2200534
Chemical name |
Dichloro[N,N'-bis(2,6-diisopropylphenyl)-1,2-ethanediimine-N,N']palladium |
Formula |
C26 H36 Cl2 N2 Pd |
Calculated formula |
C26 H36 Cl2 N2 Pd |
SMILES |
[Pd]1([N](=CC=[N]1c1c(cccc1C(C)C)C(C)C)c1c(cccc1C(C)C)C(C)C)(Cl)Cl |
Title of publication |
Dichloro[<i>N</i>,<i>N</i>'-bis(2,6-diisopropylphenyl)-1,2-ethanediimine-<i>N</i>,<i>N</i>']palladium |
Authors of publication |
Comerlato, Nadia M.; Crossetti, Geraldo L.; Howie, R. Alan; Tibultino, Pollyanna C.D.; Wardell, James L. |
Journal of publication |
Acta Crystallographica Section E |
Year of publication |
2001 |
Journal volume |
57 |
Journal issue |
7 |
Pages of publication |
m295 - m297 |
a |
13.7198 ± 0.0001 Å |
b |
15.3812 ± 0.0002 Å |
c |
13.8702 ± 0.0002 Å |
α |
90° |
β |
110.387 ± 0.0005° |
γ |
90° |
Cell volume |
2743.64 ± 0.06 Å3 |
Cell temperature |
150 ± 2 K |
Ambient diffraction temperature |
150 ± 2 K |
Number of distinct elements |
5 |
Space group number |
14 |
Hermann-Mauguin space group symbol |
P 1 21/a 1 |
Hall space group symbol |
-P 2yab |
Residual factor for all reflections |
0.037 |
Residual factor for significantly intense reflections |
0.029 |
Weighted residual factors for all reflections included in the refinement |
0.075 |
Goodness-of-fit parameter for all reflections included in the refinement |
1.08 |
Diffraction radiation wavelength |
0.71073 Å |
Diffraction radiation type |
MoKα |
Yes |
No |
Yes |