Information card for entry 2201776
Chemical name |
R-(-)-5,6,9,10-tetrahydro-10- [(2-methyl-1H-imidazol-1-yl)-methyl]-4H-pyrido[3,2,1-jk]-carbazol-11(8H)-one monohydrochloride monohydrate |
Formula |
C20 H24 Cl N3 O2 |
Calculated formula |
C20 H24 Cl N3 O2 |
Title of publication |
Cilansetron hydrochloride monohydrate, modification A (monoclinic) |
Authors of publication |
Jones, Peter G.; Möller, Hedwig; Finner, Emil |
Journal of publication |
Acta Crystallographica Section E |
Year of publication |
2003 |
Journal volume |
59 |
Journal issue |
1 |
Pages of publication |
o38 - o40 |
a |
15.403 ± 0.003 Å |
b |
7.3835 ± 0.0014 Å |
c |
16.281 ± 0.003 Å |
α |
90° |
β |
92.438 ± 0.012° |
γ |
90° |
Cell volume |
1849.9 ± 0.6 Å3 |
Cell temperature |
173 ± 2 K |
Ambient diffraction temperature |
173 ± 2 K |
Number of distinct elements |
5 |
Space group number |
4 |
Hermann-Mauguin space group symbol |
P 1 21 1 |
Hall space group symbol |
P 2yb |
Residual factor for all reflections |
0.0772 |
Residual factor for significantly intense reflections |
0.0458 |
Weighted residual factors for significantly intense reflections |
0.0937 |
Weighted residual factors for all reflections included in the refinement |
0.103 |
Goodness-of-fit parameter for all reflections included in the refinement |
0.9 |
Diffraction radiation wavelength |
0.71073 Å |
Diffraction radiation type |
MoKα |
Yes |
Yes |
Yes |