Information card for entry 2201842
Chemical name |
Nitratotris(2,2,6,6-tetramethyl-3,5-heptadionato)hafnium(IV) |
Formula |
C33 H57 Hf N O9 |
Calculated formula |
C33 H57 Hf N O9 |
Title of publication |
Nitratotris(2,2,6,6-tetramethyl-3,5-heptadionato)hafnium(IV) |
Authors of publication |
Urs, Usha K.; Dharmaprakash, M. S.; Shivashankar, S. A.; Guru Row, T. N. |
Journal of publication |
Acta Crystallographica Section E |
Year of publication |
2003 |
Journal volume |
59 |
Journal issue |
1 |
Pages of publication |
m1 - m2 |
a |
10.156 ± 0.009 Å |
b |
10.59 ± 0.009 Å |
c |
19.277 ± 0.017 Å |
α |
79.683 ± 0.016° |
β |
75.336 ± 0.016° |
γ |
83.579 ± 0.016° |
Cell volume |
1968 ± 3 Å3 |
Cell temperature |
293 ± 2 K |
Ambient diffraction temperature |
293 ± 2 K |
Number of distinct elements |
5 |
Space group number |
2 |
Hermann-Mauguin space group symbol |
P -1 |
Hall space group symbol |
-P 1 |
Residual factor for significantly intense reflections |
0.0607 |
Weighted residual factors for all reflections included in the refinement |
0.1373 |
Goodness-of-fit parameter for all reflections included in the refinement |
0.918 |
Diffraction radiation wavelength |
0.71073 Å |
Diffraction radiation type |
MoKα |
Yes |
Yes |
Yes |