Information card for entry 2202620
Chemical name |
1,4-Dimethylpyridinium bis(2-oxo-1,3-dithiole-4,5-dithiolato)diphenylantimonate(1-) |
Formula |
C25 H20 N O2 S8 Sb |
Calculated formula |
C25 H20 N O2 S8 Sb |
Title of publication |
1,4-Dimethylpyridinium bis(2-oxo-1,3-dithiole-4,5-dithiolato)diphenylantimonate(V) |
Authors of publication |
Chohan, Zahid H.; Comerlato, Nadia M.; Howie, R. Alan; Skakle, Janet M. S.; Wardell, James L. |
Journal of publication |
Acta Crystallographica Section E |
Year of publication |
2003 |
Journal volume |
59 |
Journal issue |
11 |
Pages of publication |
m1006 - m1009 |
a |
10.7513 ± 0.0005 Å |
b |
12.013 ± 0.0006 Å |
c |
13.5273 ± 0.0006 Å |
α |
94.063 ± 0.001° |
β |
112.126 ± 0.001° |
γ |
108.137 ± 0.001° |
Cell volume |
1502.53 ± 0.12 Å3 |
Cell temperature |
291 ± 2 K |
Ambient diffraction temperature |
291 ± 2 K |
Number of distinct elements |
6 |
Space group number |
2 |
Hermann-Mauguin space group symbol |
P -1 |
Hall space group symbol |
-P 1 |
Residual factor for all reflections |
0.073 |
Residual factor for significantly intense reflections |
0.038 |
Weighted residual factors for significantly intense reflections |
0.064 |
Weighted residual factors for all reflections included in the refinement |
0.072 |
Goodness-of-fit parameter for all reflections included in the refinement |
0.882 |
Diffraction radiation wavelength |
0.71073 Å |
Diffraction radiation type |
MoKα |
Yes |
No |
Yes |