Information card for entry 2202655
Structure factors | 2202655.hkl |
Original IUCr paper | HTML |
Common name | catena-Poly[[(pyridine-κN)copper(II)]-μ-N-salicylideneglycinato- κ^4^O,N,O':O'] |
Chemical name | catena-Poly[[(pyridine-κN)copper(II)]-μ-N-salicylideneglycinato- κ^4^O,N,O':O'] |
Formula | C14 H12 Cu N2 O3 |
Calculated formula | C14 H12 Cu N2 O3 |
SMILES | [Cu]12(Oc3c(cccc3)C=[N]2CC(=O)O1)([n]1ccccc1)[O]=C1O[Cu]2(Oc3c(cccc3)C=[N]2C1)[n]1ccccc1 |
Title of publication | <i>catena</i>-Poly[[(pyridine-κ<i>N</i>)copper(II)]-μ-<i>N</i>-salicylideneglycinato-κ^4^<i>O,N,O</i>':<i>O</i>'] |
Authors of publication | Butcher, Ray J.; Mockler, Garry M.; McKern, Owen |
Journal of publication | Acta Crystallographica Section E |
Year of publication | 2003 |
Journal volume | 59 |
Journal issue | 12 |
Pages of publication | m1104 - m1106 |
a | 11.8517 ± 0.0015 Å |
b | 11.7867 ± 0.0017 Å |
c | 9.6046 ± 0.0011 Å |
α | 90° |
β | 102.929 ± 0.008° |
γ | 90° |
Cell volume | 1307.7 ± 0.3 Å3 |
Cell temperature | 293 ± 2 K |
Ambient diffraction temperature | 293 ± 2 K |
Number of distinct elements | 5 |
Space group number | 14 |
Hermann-Mauguin space group symbol | P 1 21/c 1 |
Hall space group symbol | -P 2ybc |
Residual factor for all reflections | 0.0417 |
Residual factor for significantly intense reflections | 0.0315 |
Weighted residual factors for significantly intense reflections | 0.0802 |
Weighted residual factors for all reflections included in the refinement | 0.0857 |
Goodness-of-fit parameter for all reflections included in the refinement | 1.046 |
Diffraction radiation wavelength | 0.71073 Å |
Diffraction radiation type | MoKα |