Information card for entry 2202662
Structure factors | 2202662.hkl |
Original IUCr paper | HTML |
Chemical name | 3,10-Bis(2,6-dichlorophenyl)-4,11-diphenyl-1,8-dioxa-2,9- diazadispiro[4.1.4.4]pentadeca-2,9-dien-6-one |
Formula | C35 H26 Cl4 N2 O3 |
Calculated formula | C35 H26 Cl4 N2 O3 |
SMILES | Clc1c(C2=NO[C@]3(C(=O)[C@]4(ON=C([C@@H]4c4ccccc4)c4c(Cl)cccc4Cl)CCCC3)[C@H]2c2ccccc2)c(Cl)ccc1.Clc1c(C2=NO[C@@]3(C(=O)[C@@]4(ON=C([C@H]4c4ccccc4)c4c(Cl)cccc4Cl)CCCC3)[C@@H]2c2ccccc2)c(Cl)ccc1 |
Title of publication | 3,10-Bis(2,6-dichlorophenyl)-4,11-diphenyl-1,8-dioxa-2,9-diazadispiro[4.1.4.4]pentadeca-2,9-dien-6-one |
Authors of publication | Li, Xiao-Fang; Feng, Ya-Qing; Yao,Guang-Yuan; You, Xu-Dong |
Journal of publication | Acta Crystallographica Section E |
Year of publication | 2003 |
Journal volume | 59 |
Journal issue | 11 |
Pages of publication | o1852 - o1853 |
a | 9.095 ± 0.003 Å |
b | 13.01 ± 0.004 Å |
c | 14.078 ± 0.004 Å |
α | 79.674 ± 0.005° |
β | 86.207 ± 0.005° |
γ | 72.793 ± 0.004° |
Cell volume | 1565.3 ± 0.8 Å3 |
Cell temperature | 293 ± 2 K |
Ambient diffraction temperature | 293 ± 2 K |
Number of distinct elements | 5 |
Space group number | 2 |
Hermann-Mauguin space group symbol | P -1 |
Hall space group symbol | -P 1 |
Residual factor for all reflections | 0.097 |
Residual factor for significantly intense reflections | 0.048 |
Weighted residual factors for all reflections included in the refinement | 0.1354 |
Goodness-of-fit parameter for all reflections included in the refinement | 1.061 |
Diffraction radiation wavelength | 0.71073 Å |
Diffraction radiation type | MoKα |