Information card for entry 2205824
Original IUCr paper | HTML |
Common name | Ammonium manganese sulfate |
Chemical name | Diammonium dimanganese(II) trissulfate(IV) |
Formula | H8 Mn2 N2 O12 S3 |
Calculated formula | H8 Mn2 N2 O12 S3 |
Title of publication | Langbeinite-type (NH~4~)~2~Mn~2~(SO~4~)~3~ |
Authors of publication | Zhang, Xian-Ming; Hao, Zheng-Ming; Ng, Seik Weng |
Journal of publication | Acta Crystallographica, Section E |
Year of publication | 2005 |
Journal volume | 61 |
Journal issue | 5 |
Pages of publication | i82 - i83 |
a | 10.188 ± 0.002 Å |
b | 10.188 ± 0.002 Å |
c | 10.188 ± 0.002 Å |
α | 90° |
β | 90° |
γ | 90° |
Cell volume | 1057.5 ± 0.4 Å3 |
Cell temperature | 295 ± 2 K |
Ambient diffraction temperature | 295 ± 2 K |
Number of distinct elements | 5 |
Space group number | 198 |
Hermann-Mauguin space group symbol | P 21 3 |
Hall space group symbol | P 2ac 2ab 3 |
Residual factor for all reflections | 0.035 |
Residual factor for significantly intense reflections | 0.03 |
Weighted residual factors for significantly intense reflections | 0.069 |
Weighted residual factors for all reflections included in the refinement | 0.071 |
Goodness-of-fit parameter for all reflections included in the refinement | 1.05 |
Diffraction radiation wavelength | 0.71073 Å |
Diffraction radiation type | MoKα |