Information card for entry 2228137
Chemical name |
3-(12-Bromododecyl)-1,5-dimethyl-1<i>H</i>-1,5-benzodiazepine- 2,4(3<i>H</i>,5<i>H</i>)-dione |
Formula |
C23 H35 Br N2 O2 |
Calculated formula |
C23 H35 Br N2 O2 |
SMILES |
BrCCCCCCCCCCCCC1C(=O)N(c2ccccc2N(C1=O)C)C |
Title of publication |
3-(12-Bromododecyl)-1,5-dimethyl-1<i>H</i>-1,5-benzodiazepine-2,4(3<i>H</i>,5<i>H</i>)-dione |
Authors of publication |
Dardouri, Rchida; Ouazzani Chahdi, Fouad; Saffon, Natalie; Essassi, El Mokhtar; Ng, Seik Weng |
Journal of publication |
Acta Crystallographica Section E |
Year of publication |
2010 |
Journal volume |
66 |
Journal issue |
11 |
Pages of publication |
o2805 |
a |
7.5971 ± 0.0001 Å |
b |
10.5032 ± 0.0002 Å |
c |
28.7129 ± 0.0005 Å |
α |
90° |
β |
95.213 ± 0.001° |
γ |
90° |
Cell volume |
2281.64 ± 0.07 Å3 |
Cell temperature |
293 ± 2 K |
Ambient diffraction temperature |
293 ± 2 K |
Number of distinct elements |
5 |
Space group number |
14 |
Hermann-Mauguin space group symbol |
P 1 21/n 1 |
Hall space group symbol |
-P 2yn |
Residual factor for all reflections |
0.0742 |
Residual factor for significantly intense reflections |
0.0391 |
Weighted residual factors for significantly intense reflections |
0.0861 |
Weighted residual factors for all reflections included in the refinement |
0.0985 |
Goodness-of-fit parameter for all reflections included in the refinement |
0.991 |
Diffraction radiation wavelength |
0.71073 Å |
Diffraction radiation type |
MoKα |
Yes |
No |
Yes |