Information card for entry 2237853
Structure factors | 2237853.hkl |
Original IUCr paper | HTML |
Chemical name | <i>catena</i>-Poly[[manganese(III)-bis{μ-2-[(2-hydroxyethyl)iminomethyl]-6-methoxyphenolato-κ^3^<i>O</i>^1^,<i>N</i>:<i>O</i>^2^;κ^3^<i>O</i>^2^:<i>N</i>,<i>O</i>^1^}] iodide] |
Formula | C20 H24 I Mn N2 O6 |
Calculated formula | C20 H24 I Mn N2 O6 |
Title of publication | <i>catena</i>-Poly[[manganese(III)-bis{μ-2-[(2-hydroxyethyl)iminomethyl]-6-methoxyphenolato-κ^3^<i>O</i>^1^,<i>N</i>:<i>O</i>^2^;κ^3^<i>O</i>^2^:<i>N</i>,<i>O</i>^1^}] iodide] |
Authors of publication | Petrusenko, Svitlana R.; Stetsyuk, Oleg M.; Omelchenko, Irina V. |
Journal of publication | Acta Crystallographica Section E |
Year of publication | 2013 |
Journal volume | 69 |
Journal issue | 6 |
Pages of publication | m326 - m327 |
a | 18.88 ± 0.002 Å |
b | 5.8979 ± 0.001 Å |
c | 20.916 ± 0.002 Å |
α | 90° |
β | 90° |
γ | 90° |
Cell volume | 2329 ± 0.5 Å3 |
Cell temperature | 298 ± 2 K |
Ambient diffraction temperature | 298 ± 2 K |
Number of distinct elements | 6 |
Space group number | 29 |
Hermann-Mauguin space group symbol | P c a 21 |
Hall space group symbol | P 2c -2ac |
Residual factor for all reflections | 0.1895 |
Residual factor for significantly intense reflections | 0.0756 |
Weighted residual factors for significantly intense reflections | 0.1373 |
Weighted residual factors for all reflections included in the refinement | 0.1731 |
Goodness-of-fit parameter for all reflections included in the refinement | 0.922 |
Diffraction radiation wavelength | 0.71073 Å |
Diffraction radiation type | MoKα |