Information card for entry 2239967
Structure factors | 2239967.hkl |
Original IUCr paper | HTML |
Chemical name | 1-Benzyl-4-(4-chlorophenyl)-2-imino-1,2,5,6,7,8,9,10-\ octahydrocycloocta[<i>b</i>]pyridine-3-carbonitrile |
Formula | C25 H24 Cl N3 |
Calculated formula | C25 H24 Cl N3 |
SMILES | c1(c(c(c2c(CCCCCC2)n1Cc1ccccc1)c1ccc(cc1)Cl)C#N)=N |
Title of publication | Crystal structure of 1-benzyl-4-(4-chlorophenyl)-2-imino-1,2,5,6,7,8,9,10-octahydrocycloocta[<i>b</i>]pyridine-3-carbonitrile |
Authors of publication | Nagalakshmi, R. A.; Suresh, J.; Maharani, S.; Kumar, R. Ranjith; Lakshman, P. L. Nilantha |
Journal of publication | Acta Crystallographica Section E |
Year of publication | 2014 |
Journal volume | 70 |
Journal issue | 10 |
Pages of publication | 167 - 169 |
a | 10.2319 ± 0.0003 Å |
b | 10.5228 ± 0.0003 Å |
c | 11.7767 ± 0.0004 Å |
α | 101.088 ± 0.002° |
β | 107.524 ± 0.002° |
γ | 114.008 ± 0.002° |
Cell volume | 1029.87 ± 0.06 Å3 |
Cell temperature | 293 ± 2 K |
Ambient diffraction temperature | 293 ± 2 K |
Number of distinct elements | 4 |
Space group number | 2 |
Hermann-Mauguin space group symbol | P -1 |
Hall space group symbol | -P 1 |
Residual factor for all reflections | 0.0521 |
Residual factor for significantly intense reflections | 0.0377 |
Weighted residual factors for significantly intense reflections | 0.0943 |
Weighted residual factors for all reflections included in the refinement | 0.1051 |
Goodness-of-fit parameter for all reflections included in the refinement | 1.049 |
Diffraction radiation wavelength | 0.71073 Å |
Diffraction radiation type | MoKα |