Information card for entry 2240132
Structure factors | 2240132.hkl |
Original IUCr paper | HTML |
Chemical name | {2,2'-[Ethylenebis(nitrilomethanylylidene)]diphenolato-κ^4^<i>O</i>,<i>N</i>,<i>N</i>',<i>O</i>'}oxidovanadium(IV) methanol monosolvate |
Formula | C17 H18 N2 O4 V |
Calculated formula | C17 H18 N2 O4 V |
Title of publication | Crystal structure of {2,2'-[ethylenebis(nitrilomethanylylidene)]diphenolato-κ^4^<i>O</i>,<i>N</i>,<i>N</i>',<i>O</i>'}oxidovanadium(IV) methanol monosolvate |
Authors of publication | Hsuan, Rachel E.; Hughes, Jemma E.; Miller, Thomas H.; Shaikh, Nabila; Cunningham, Phoebe H. M.; O'Connor, Alice E.; Tidey, Jeremiah P.; Blake, Alexander J. |
Journal of publication | Acta Crystallographica Section E |
Year of publication | 2014 |
Journal volume | 70 |
Journal issue | 11 |
Pages of publication | m380 - m381 |
a | 12.9597 ± 0.0004 Å |
b | 8.8616 ± 0.0002 Å |
c | 28.5426 ± 0.0007 Å |
α | 90° |
β | 90° |
γ | 90° |
Cell volume | 3277.94 ± 0.15 Å3 |
Cell temperature | 120 ± 2 K |
Ambient diffraction temperature | 120 ± 2 K |
Number of distinct elements | 5 |
Space group number | 33 |
Hermann-Mauguin space group symbol | P n a 21 |
Hall space group symbol | P 2c -2n |
Residual factor for all reflections | 0.0401 |
Residual factor for significantly intense reflections | 0.0368 |
Weighted residual factors for significantly intense reflections | 0.1 |
Weighted residual factors for all reflections included in the refinement | 0.105 |
Goodness-of-fit parameter for all reflections included in the refinement | 1.04 |
Diffraction radiation wavelength | 1.54184 Å |
Diffraction radiation type | CuKα |