Information card for entry 2240923
Structure factors | 2240923.hkl |
Original IUCr paper | HTML |
Chemical name | Methyl 7-oxo-14-phenyl-1<i>H</i>,7<i>H</i>,14<i>H</i>-pyrano[3,2-<i>c</i>:5,4-<i>c</i>']dichromene-14a(6b<i>H</i>)-carboxylate] |
Formula | C27 H20 O6 |
Calculated formula | C27 H20 O6 |
SMILES | c1cccc2c1OC[C@@]1([C@H]2c2c(c3c(cccc3)oc2=O)O[C@@H]1c1ccccc1)C(=O)OC.c1cccc2c1OC[C@]1([C@@H]2c2c(c3c(cccc3)oc2=O)O[C@H]1c1ccccc1)C(=O)OC |
Title of publication | Crystal structures and conformational analyses of three pyranochromene derivatives |
Authors of publication | Swaminathan, K.; Sethusankar, K.; Kumar, G. Siva; Bakthadoss, M. |
Journal of publication | Acta Crystallographica Section E |
Year of publication | 2015 |
Journal volume | 71 |
Journal issue | 8 |
Pages of publication | 926 - 930 |
a | 9.398 ± 0.0015 Å |
b | 14.005 ± 0.0012 Å |
c | 15.989 ± 0.0013 Å |
α | 90° |
β | 92.048 ± 0.005° |
γ | 90° |
Cell volume | 2103.1 ± 0.4 Å3 |
Cell temperature | 296 ± 2 K |
Ambient diffraction temperature | 296 ± 2 K |
Number of distinct elements | 3 |
Space group number | 14 |
Hermann-Mauguin space group symbol | P 1 21/c 1 |
Hall space group symbol | -P 2ybc |
Residual factor for all reflections | 0.049 |
Residual factor for significantly intense reflections | 0.0368 |
Weighted residual factors for significantly intense reflections | 0.0956 |
Weighted residual factors for all reflections included in the refinement | 0.1063 |
Goodness-of-fit parameter for all reflections included in the refinement | 1.073 |
Diffraction radiation wavelength | 0.71073 Å |
Diffraction radiation type | MoKα |