Information card for entry 2241921
Original IUCr paper | HTML |
Chemical name | 2-(4,5-Dimethoxy-2-nitrophenyl)-4-hydroxy-9-phenylsulfonyl-9<i>H</i>-carbazole-3-carbaldehyde |
Formula | C27 H20 N2 O8 S |
Calculated formula | C27 H20 N2 O8 S |
SMILES | c1cccc2c1c1c(cc(c(c1O)C=O)c1cc(c(cc1N(=O)=O)OC)OC)n2S(=O)(=O)c1ccccc1 |
Title of publication | Crystal structures of three carbazole derivatives: 12-ethyl-7-phenylsulfonyl-7<i>H</i>-benzofuro[2,3-<i>b</i>]carbazole, (1), 2-(4,5-dimethoxy-2-nitrophenyl)-4-hydroxy-9-phenylsulfonyl-9<i>H</i>-carbazole-3-carbaldehyde, (2), and 12-phenyl-7-phenylsulfonyl-7<i>H</i>-benzofuro[2,3-<i>b</i>]carbazole, (3) |
Authors of publication | Gangadharan, Rajeswari; Narayanan, P.; Sethusankar, K.; Saravanan, Velu; Mohanakrishnan, Arasambattu K. |
Journal of publication | Acta Crystallographica Section E |
Year of publication | 2016 |
Journal volume | 72 |
Journal issue | 12 |
Pages of publication | 1744 - 1750 |
a | 11.2133 ± 0.0003 Å |
b | 14.5811 ± 0.0004 Å |
c | 15.1509 ± 0.0004 Å |
α | 90° |
β | 102.32 ± 0.001° |
γ | 90° |
Cell volume | 2420.16 ± 0.11 Å3 |
Cell temperature | 296 ± 2 K |
Ambient diffraction temperature | 296 ± 2 K |
Number of distinct elements | 5 |
Space group number | 14 |
Hermann-Mauguin space group symbol | P 1 21/c 1 |
Hall space group symbol | -P 2ybc |
Residual factor for all reflections | 0.075 |
Residual factor for significantly intense reflections | 0.0469 |
Weighted residual factors for significantly intense reflections | 0.1256 |
Weighted residual factors for all reflections included in the refinement | 0.1504 |
Goodness-of-fit parameter for all reflections included in the refinement | 1.004 |
Diffraction radiation wavelength | 0.71073 Å |
Diffraction radiation type | MoKα |