Information card for entry 2242276
Structure factors | 2242276.hkl |
Original IUCr paper | HTML |
Chemical name | Tetrabutylammonium chloride‒1,1'-(1,2-phenylene)bis(3-<i>m</i>-tolylurea) (1/1) |
Formula | C38 H58 Cl N5 O2 |
Calculated formula | C38 H58 Cl N5 O2 |
SMILES | [Cl-].O=C(Nc1c(NC(=O)Nc2cc(ccc2)C)cccc1)Nc1cc(ccc1)C.[N+](CCCC)(CCCC)(CCCC)CCCC |
Title of publication | Crystal structures of the 2:2 complex of 1,1'-(1,2-phenylene)bis(3-<i>m</i>-tolylurea) and tetrabutylammonium chloride or bromide |
Authors of publication | Huang, Chao; Wang, Ruyu; Shu, Xi; Fan, Yu; Qi, Yue; Li, Shoujian; Xia, Chuanqin |
Journal of publication | Acta Crystallographica Section E |
Year of publication | 2017 |
Journal volume | 73 |
Journal issue | 9 |
Pages of publication | 1316 - 1319 |
a | 13.5654 ± 0.0004 Å |
b | 20.0993 ± 0.0006 Å |
c | 14.3329 ± 0.0004 Å |
α | 90° |
β | 99.658 ± 0.003° |
γ | 90° |
Cell volume | 3852.5 ± 0.2 Å3 |
Cell temperature | 293.57 ± 0.1 K |
Ambient diffraction temperature | 294 K |
Number of distinct elements | 5 |
Space group number | 14 |
Hermann-Mauguin space group symbol | P 1 21/n 1 |
Hall space group symbol | -P 2yn |
Residual factor for all reflections | 0.0941 |
Residual factor for significantly intense reflections | 0.0815 |
Weighted residual factors for significantly intense reflections | 0.2262 |
Weighted residual factors for all reflections included in the refinement | 0.2518 |
Goodness-of-fit parameter for all reflections included in the refinement | 1.0504 |
Diffraction radiation wavelength | 1.54184 Å |
Diffraction radiation type | CuKα |