Information card for entry 2242663
Structure factors | 2242663.hkl |
Chemical name | <i>trans<i>-Bis(ethylenediamine)(isothiocyanato)nitritocobalt(III) perchlorate‒thiocyanate(0.75/0.25) |
Formula | C5.25 H16 Cl0.75 Co N6.25 O5 S1.25 |
Calculated formula | C5.25 H16 Cl0.75 Co N6.25 O5 S1.25 |
Title of publication | Investigation of solid-state photochemical nitro‒nitrito linkage isomerization: crystal structures of <i>trans</i>-bis(ethylenediamine)(isothiocyanato)nitritocobalt(III) salts: thiocyanate, chloride monohydrate, and perchlorate‒thiocyanate(0.75/0.25) |
Authors of publication | Ohba, Shigeru; Tsuchimoto, Masanobu; Kurachi, Saeko |
Journal of publication | Acta Crystallographica Section E |
Year of publication | 2018 |
Journal volume | 74 |
Journal issue | 10 |
Pages of publication | 1526 - 1531 |
a | 11.3141 ± 0.0006 Å |
b | 16.2969 ± 0.0007 Å |
c | 16.1298 ± 0.0007 Å |
α | 90° |
β | 109.023 ± 0.002° |
γ | 90° |
Cell volume | 2811.7 ± 0.2 Å3 |
Cell temperature | 301 ± 2 K |
Ambient diffraction temperature | 301 K |
Number of distinct elements | 7 |
Space group number | 14 |
Hermann-Mauguin space group symbol | P 1 21/n 1 |
Hall space group symbol | -P 2yn |
Residual factor for all reflections | 0.0837 |
Residual factor for significantly intense reflections | 0.0626 |
Weighted residual factors for significantly intense reflections | 0.1697 |
Weighted residual factors for all reflections included in the refinement | 0.2208 |
Goodness-of-fit parameter for all reflections included in the refinement | 1.099 |
Diffraction radiation wavelength | 0.71073 Å |
Diffraction radiation type | MoKα |