Information card for entry 2242875
Structure factors | 2242875.hkl |
Original IUCr paper | HTML |
Chemical name | <i>N</i>-(2,4-Dimethoxybenzyl)-2-[(2-oxo-2<i>H</i>-chromen-4-yl)oxy]acetamide |
Formula | C20 H19 N O6 |
Calculated formula | C20 H19 N O6 |
SMILES | c1(=O)cc(c2c(cccc2)o1)OCC(=O)NCc1ccc(cc1OC)OC |
Title of publication | The crystal structures of two new coumarin derivatives: 2-(4-{2-[(2-oxo-2<i>H</i>-chromen-4-yl)oxy]acetyl}piperazin-1-yl)acetamide and <i>N</i>-(2,4-dimethoxybenzyl)-2-[(2-oxo-2<i>H</i>-chromen-4-yl)oxy]acetamide |
Authors of publication | Syed Abuthahir, S.; NizamMohideen, M.; Viswanathan, V.; Govindhan, M.; Subramanian, K. |
Journal of publication | Acta Crystallographica Section E |
Year of publication | 2019 |
Journal volume | 75 |
Journal issue | 4 |
Pages of publication | 482 - 488 |
a | 7.2779 ± 0.0002 Å |
b | 8.5759 ± 0.0003 Å |
c | 14.4099 ± 0.0005 Å |
α | 90° |
β | 93.796 ± 0.005° |
γ | 90° |
Cell volume | 897.41 ± 0.05 Å3 |
Cell temperature | 296 ± 2 K |
Ambient diffraction temperature | 296 ± 2 K |
Number of distinct elements | 4 |
Space group number | 4 |
Hermann-Mauguin space group symbol | P 1 21 1 |
Hall space group symbol | P 2yb |
Residual factor for all reflections | 0.1246 |
Residual factor for significantly intense reflections | 0.0832 |
Weighted residual factors for significantly intense reflections | 0.2039 |
Weighted residual factors for all reflections included in the refinement | 0.2425 |
Goodness-of-fit parameter for all reflections included in the refinement | 0.979 |
Diffraction radiation wavelength | 0.71073 Å |
Diffraction radiation type | MoKα |