Information card for entry 2243012
Structure factors | 2243012.hkl |
Original IUCr paper | HTML |
Common name | (3a<i>R</i>,4<i>S</i>,7<i>R</i>,7a<i>S</i>)-2-(Perfluoropyridin-4-yl)-3a,4,7,7a-tetrahydro-4,7-methanoisoindole-1,3-dione |
Formula | C14 H8 F4 N2 O2 |
Calculated formula | C14 H8 F4 N2 O2 |
SMILES | Fc1nc(F)c(F)c(N2C(=O)[C@H]3[C@H]4C=C[C@@H]([C@H]3C2=O)C4)c1F |
Title of publication | Syntheses, crystal structures and Hirshfeld surface analyses of (3a<i>R</i>,4<i>S</i>,7<i>R</i>,7a<i>S</i>)-2-(perfluoropyridin-4-yl)-3a,4,7,7a-tetrahydro-4,7-methanoisoindole-1,3-dione and (3a<i>R</i>,4<i>S</i>,7<i>R</i>,7a<i>S</i>)-2-[(perfluoropyridin-4-yl)oxy]-3a,4,7,7a-tetrahydro-4,7-methanoisoindole-1,3-dione |
Authors of publication | Peloquin, Andrew J.; Balaich, Gary J.; Iacono, Scott T. |
Journal of publication | Acta Crystallographica Section E |
Year of publication | 2019 |
Journal volume | 75 |
Journal issue | 8 |
Pages of publication | 1153 - 1157 |
a | 7.0347 ± 0.0015 Å |
b | 10.256 ± 0.002 Å |
c | 18.129 ± 0.004 Å |
α | 78.844 ± 0.01° |
β | 80.165 ± 0.01° |
γ | 87.242 ± 0.01° |
Cell volume | 1264.2 ± 0.5 Å3 |
Cell temperature | 100 ± 2 K |
Ambient diffraction temperature | 100 ± 2 K |
Number of distinct elements | 5 |
Space group number | 2 |
Hermann-Mauguin space group symbol | P -1 |
Hall space group symbol | -P 1 |
Residual factor for all reflections | 0.0553 |
Residual factor for significantly intense reflections | 0.0447 |
Weighted residual factors for significantly intense reflections | 0.116 |
Weighted residual factors for all reflections included in the refinement | 0.1259 |
Goodness-of-fit parameter for all reflections included in the refinement | 1.023 |
Diffraction radiation wavelength | 0.71073 Å |
Diffraction radiation type | MoKα |