Information card for entry 2243025
Structure factors | 2243025.hkl |
Original IUCr paper | HTML |
Chemical name | (<i>E</i>)-1-(4-Chlorophenyl)-2-[2,2-dichloro-1-(4-nitrophenyl)ethenyl]diazene |
Formula | C14 H8 Cl3 N3 O2 |
Calculated formula | C14 H8 Cl3 N3 O2 |
SMILES | c1(ccc(cc1)Cl)/N=N/C(=C(Cl)Cl)c1ccc(cc1)N(=O)=O |
Title of publication | Crystal structures and Hirshfeld surface analyses of the two isotypic compounds (<i>E</i>)-1-(4-bromophenyl)-2-[2,2-dichloro-1-(4-nitrophenyl)ethenyl]diazene and (<i>E</i>)-1-(4-chlorophenyl)-2-[2,2-dichloro-1-(4-nitrophenyl)ethenyl]diazene |
Authors of publication | Akkurt, Mehmet; Shikhaliyev, Namiq Q.; Suleymanova, Gulnar T.; Babayeva, Gulnare V.; Mammadova, Gunay Z.; Niyazova, Ayten A.; Shikhaliyeva, Irada M.; Toze, Flavien A. A. |
Journal of publication | Acta Crystallographica Section E |
Year of publication | 2019 |
Journal volume | 75 |
Journal issue | 8 |
Pages of publication | 1199 - 1204 |
a | 13.8689 ± 0.0007 Å |
b | 13.3674 ± 0.0007 Å |
c | 8.362 ± 0.0005 Å |
α | 90° |
β | 90° |
γ | 90° |
Cell volume | 1550.24 ± 0.15 Å3 |
Cell temperature | 296 ± 2 K |
Ambient diffraction temperature | 296 ± 2 K |
Number of distinct elements | 5 |
Space group number | 33 |
Hermann-Mauguin space group symbol | P n a 21 |
Hall space group symbol | P 2c -2n |
Residual factor for all reflections | 0.0549 |
Residual factor for significantly intense reflections | 0.0369 |
Weighted residual factors for significantly intense reflections | 0.0831 |
Weighted residual factors for all reflections included in the refinement | 0.0914 |
Goodness-of-fit parameter for all reflections included in the refinement | 1.043 |
Diffraction radiation wavelength | 0.71073 Å |
Diffraction radiation type | MoKα |