Information card for entry 2243083
Chemical name |
4-(5-Acetamido-3-acetyl-2-methyl-2,3-dihydro-1,3,4-thiadiazol-2-yl)phenyl propionate |
Formula |
C16 H19 N3 O4 S |
Calculated formula |
C16 H19 N3 O4 S |
Title of publication |
The crystal structures and Hirshfeld surface analyses of four 3,5-diacetyl-2-methyl-2,3-dihydro-1,3,4-thiadiazol-2-yl derivatives |
Authors of publication |
NizamMohideen, M.; Syed Abuthahir, S.; Viswanathan, V.; Velmurugan, D.; Karthik Ananth, M. |
Journal of publication |
Acta Crystallographica Section E |
Year of publication |
2019 |
Journal volume |
75 |
Journal issue |
10 |
Pages of publication |
1436 - 1444 |
a |
11.415 ± 0.0003 Å |
b |
12.4021 ± 0.0003 Å |
c |
13.2305 ± 0.0003 Å |
α |
71.982 ± 0.001° |
β |
89.829 ± 0.001° |
γ |
83.114 ± 0.001° |
Cell volume |
1767.18 ± 0.08 Å3 |
Cell temperature |
293 ± 2 K |
Ambient diffraction temperature |
293 ± 2 K |
Number of distinct elements |
5 |
Space group number |
2 |
Hermann-Mauguin space group symbol |
P -1 |
Hall space group symbol |
-P 1 |
Residual factor for all reflections |
0.0482 |
Residual factor for significantly intense reflections |
0.0371 |
Weighted residual factors for significantly intense reflections |
0.0977 |
Weighted residual factors for all reflections included in the refinement |
0.106 |
Goodness-of-fit parameter for all reflections included in the refinement |
1.03 |
Diffraction radiation wavelength |
0.71073 Å |
Diffraction radiation type |
MoKα |
Yes |
Yes |
Yes |