Information card for entry 2243129
Chemical name |
Benzyl <i>N</i>'-[(1<i>E</i>,4<i>E</i>)-1,5-bis(4-methoxyphenyl)penta-1,4-dien-3-ylidene]hydrazine-1-carbodithioate |
Formula |
C27 H26 N2 O2 S2 |
Calculated formula |
C27 H26 N2 O2 S2 |
Title of publication |
Crystal structure of benzyl <i>N</i>'-[(1<i>E</i>,4<i>E</i>)-1,5-bis(4-methoxyphenyl)penta-1,4-dien-3-ylidene]hydrazine-1-carbodithioate |
Authors of publication |
Arif Tawfeeq, Nabeel; Kwong, Huey Chong; Mohamed Tahir, Mohamed Ibrahim; Ravoof, Thahira B. S. A. |
Journal of publication |
Acta Crystallographica Section E |
Year of publication |
2019 |
Journal volume |
75 |
Journal issue |
11 |
Pages of publication |
1613 - 1619 |
a |
10.201 ± 0.0001 Å |
b |
20.026 ± 0.0003 Å |
c |
25.2349 ± 0.0004 Å |
α |
70.535 ± 0.001° |
β |
86.852 ± 0.001° |
γ |
82.147 ± 0.001° |
Cell volume |
4814.65 ± 0.12 Å3 |
Cell temperature |
100 K |
Ambient diffraction temperature |
100 K |
Number of distinct elements |
5 |
Space group number |
2 |
Hermann-Mauguin space group symbol |
P -1 |
Hall space group symbol |
-P 1 |
Residual factor for all reflections |
0.0585 |
Residual factor for significantly intense reflections |
0.0475 |
Weighted residual factors for significantly intense reflections |
0.1229 |
Weighted residual factors for all reflections included in the refinement |
0.1304 |
Goodness-of-fit parameter for all reflections included in the refinement |
1.027 |
Diffraction radiation wavelength |
1.54178 Å |
Diffraction radiation type |
CuKα |
Yes |
Yes |
Yes |