Information card for entry 2243236
Chemical name |
6-(4-Bromophenyl)-2-(4-chlorobenzyl)-5-[(1<i>H</i>-indol-3-yl)methyl]imidazo[2,1-<i>b</i>][1,3,4]thiadiazole |
Formula |
C26 H18 Br Cl N4 S |
Calculated formula |
C26 H18 Br Cl N4 S |
Title of publication |
Crystal structures of three 6-aryl-2-(4-chlorobenzyl)-5-[(1<i>H</i>-indol-3-yl)methyl]imidazo[2,1-<i>b</i>][1,3,4]thiadiazoles |
Authors of publication |
Shamanth, Sadashivamurthy; Mantelingu, Kempegowda; Kiran Kumar, Haruvegowda; Yathirajan, Hemmige S.; Foro, Sabine; Glidewell, Christopher |
Journal of publication |
Acta Crystallographica Section E |
Year of publication |
2020 |
Journal volume |
76 |
Journal issue |
1 |
Pages of publication |
18 - 24 |
a |
9.5735 ± 0.0008 Å |
b |
9.686 ± 0.0009 Å |
c |
25.644 ± 0.002 Å |
α |
90° |
β |
90° |
γ |
90° |
Cell volume |
2377.9 ± 0.4 Å3 |
Cell temperature |
296 ± 2 K |
Ambient diffraction temperature |
296 ± 2 K |
Number of distinct elements |
6 |
Space group number |
19 |
Hermann-Mauguin space group symbol |
P 21 21 21 |
Hall space group symbol |
P 2ac 2ab |
Residual factor for all reflections |
0.0783 |
Residual factor for significantly intense reflections |
0.0447 |
Weighted residual factors for significantly intense reflections |
0.0916 |
Weighted residual factors for all reflections included in the refinement |
0.1001 |
Goodness-of-fit parameter for all reflections included in the refinement |
1.023 |
Diffraction radiation wavelength |
0.71073 Å |
Diffraction radiation type |
MoKα |
Yes |
Yes |
Yes |