Information card for entry 2243239
Chemical name |
Ethyl 4-(anthracen-9-yl)-2,7,7-trimethyl-5-oxo-1,4,5,6,7,8-hexahydroquinoline-3-carboxylate |
Formula |
C29 H29 N O3 |
Calculated formula |
C29 H29 N O3 |
SMILES |
O=C1C2=C(NC(=C(C2c2c3ccccc3cc3c2cccc3)C(=O)OCC)C)CC(C1)(C)C |
Title of publication |
Synthesis and crystal structures of a bis(3-hydroxy-cyclohex-2-en-1-one) and two hexahydroquinoline derivatives |
Authors of publication |
Steiger, Scott A.; Li, Chun; Gates, Christina; Natale, Nicholas R. |
Journal of publication |
Acta Crystallographica Section E |
Year of publication |
2020 |
Journal volume |
76 |
Journal issue |
2 |
Pages of publication |
125 - 131 |
a |
11.6527 ± 0.0003 Å |
b |
18.1986 ± 0.0004 Å |
c |
12.3435 ± 0.0003 Å |
α |
90° |
β |
114.876 ± 0.0012° |
γ |
90° |
Cell volume |
2374.74 ± 0.1 Å3 |
Cell temperature |
100 ± 2 K |
Ambient diffraction temperature |
100 K |
Number of distinct elements |
4 |
Space group number |
14 |
Hermann-Mauguin space group symbol |
P 1 21/n 1 |
Hall space group symbol |
-P 2yn |
Residual factor for all reflections |
0.0672 |
Residual factor for significantly intense reflections |
0.0484 |
Weighted residual factors for significantly intense reflections |
0.1218 |
Weighted residual factors for all reflections included in the refinement |
0.1346 |
Goodness-of-fit parameter for all reflections included in the refinement |
1.039 |
Diffraction radiation wavelength |
0.71073 Å |
Diffraction radiation type |
MoKα |
Yes |
No |
Yes |