Information card for entry 2243285
Structure factors | 2243285.hkl |
Original IUCr paper | HTML |
Chemical name | (<i>RS</i>)-3-(4-Methoxyphenyl)-5-[4-(prop-2-ynyloxy)phenyl]-4,5-dihydropyrazole-1-carbothioamide |
Formula | C20 H19 N3 O2 S |
Calculated formula | C20 H19 N3 O2 S |
SMILES | N1(N=C(CC1c1ccc(cc1)OCC#C)c1ccc(cc1)OC)C(=S)N |
Title of publication | Conversion of diarylchalcones into 4,5-dihydropyrazole-1-carbothioamides: molecular and supramolecular structures of two precursors and three products |
Authors of publication | Shaibah, Mohammed A. E.; Yathirajan, Hemmige S.; Asma; Manju, Nagaraja; Kalluraya, Balakrishna; Rathore, Ravindranath S.; Glidewell, Christopher |
Journal of publication | Acta Crystallographica Section E |
Year of publication | 2020 |
Journal volume | 76 |
Journal issue | 3 |
Pages of publication | 360 - 365 |
a | 11.7852 ± 0.0015 Å |
b | 7.5345 ± 0.0011 Å |
c | 20.599 ± 0.003 Å |
α | 90° |
β | 93.555 ± 0.004° |
γ | 90° |
Cell volume | 1825.6 ± 0.4 Å3 |
Cell temperature | 296 ± 2 K |
Ambient diffraction temperature | 296 ± 2 K |
Number of distinct elements | 5 |
Space group number | 14 |
Hermann-Mauguin space group symbol | P 1 21/c 1 |
Hall space group symbol | -P 2ybc |
Residual factor for all reflections | 0.1466 |
Residual factor for significantly intense reflections | 0.0509 |
Weighted residual factors for significantly intense reflections | 0.0888 |
Weighted residual factors for all reflections included in the refinement | 0.1179 |
Goodness-of-fit parameter for all reflections included in the refinement | 0.967 |
Diffraction radiation wavelength | 0.71073 Å |
Diffraction radiation type | MoKα |