Information card for entry 2243297
Structure factors | 2243297.hkl |
Original IUCr paper | HTML |
Chemical name | Bis{(<i>E</i>)-1-[(2,4,6-tribromophenyl)diazenyl]naphthalen-2-olato}copper(II) dimethyl sulfoxide monosolvate |
Formula | C34 H22 Br6 Cu N4 O3 S |
Calculated formula | C34 H22 Br6 Cu N4 O3 S |
Title of publication | Crystal structure, characterization and Hirshfeld analysis of bis{(<i>E</i>)-1-[(2,4,6-tribromophenyl)diazenyl]naphthalen-2-olato}copper(II) dimethyl sulfoxide monosolvate |
Authors of publication | Chetioui, Souheyla; Bougueria, Hassiba; Brihi, Ouarda; Boutebdja, Mehdi; Bouroumane, Nadia; Merazig, Hocine; Touzani, Rachid |
Journal of publication | Acta Crystallographica Section E |
Year of publication | 2020 |
Journal volume | 76 |
Journal issue | 3 |
Pages of publication | 382 - 386 |
a | 8.9922 ± 0.0014 Å |
b | 16.461 ± 0.003 Å |
c | 24.835 ± 0.004 Å |
α | 90° |
β | 92.491 ± 0.006° |
γ | 90° |
Cell volume | 3672.6 ± 1.1 Å3 |
Cell temperature | 150 K |
Ambient diffraction temperature | 150 K |
Number of distinct elements | 7 |
Space group number | 14 |
Hermann-Mauguin space group symbol | P 1 21/n 1 |
Hall space group symbol | -P 2yn |
Residual factor for all reflections | 0.1033 |
Residual factor for significantly intense reflections | 0.0442 |
Weighted residual factors for significantly intense reflections | 0.0844 |
Weighted residual factors for all reflections included in the refinement | 0.0985 |
Goodness-of-fit parameter for all reflections included in the refinement | 0.924 |
Diffraction radiation probe | x-ray |
Diffraction radiation wavelength | 0.7107 Å |
Diffraction radiation type | MoKα |