Information card for entry 2243347
Structure factors | 2243347.hkl |
Original IUCr paper | HTML |
Chemical name | <i>catena</i>-Poly[[[(1,4,8,11-tetraazacyclotetradecane-κ^4^<i>N</i>^1^,<i>N</i>^4^,<i>N</i>^8^,<i>N</i>^11^)nickel(II)]-μ-4-({[(3-carboxypropyl)dimethylsilyl]oxy}dimethylsilyl)butanoato-κ^2^<i>O</i>:<i>O</i>'] perchlorate] |
Formula | C22 H49 Cl N4 Ni O9 Si2 |
Calculated formula | C22 H49 Cl N4 Ni O9 Si2 |
Title of publication | Syntheses and crystal structures of the one-dimensional coordination polymers formed by [Ni(cyclam)]^2+^ cations and 1,3-bis(3-carboxypropyl)tetramethyldisiloxane anions in different degrees of deprotonation |
Authors of publication | Gavrish, Sergey P.; Shova, Sergiu; Cazacu, Maria; Dascalu, Mihaela; Lampeka, Yaroslaw D. |
Journal of publication | Acta Crystallographica Section E |
Year of publication | 2020 |
Journal volume | 76 |
Journal issue | 3 |
Pages of publication | 446 - 451 |
a | 9.3815 ± 0.0007 Å |
b | 12.9009 ± 0.0008 Å |
c | 14.7604 ± 0.001 Å |
α | 99.309 ± 0.005° |
β | 100.343 ± 0.006° |
γ | 99.232 ± 0.006° |
Cell volume | 1700.9 ± 0.2 Å3 |
Cell temperature | 200 ± 0.1 K |
Ambient diffraction temperature | 200 ± 0.1 K |
Number of distinct elements | 7 |
Space group number | 2 |
Hermann-Mauguin space group symbol | P -1 |
Hall space group symbol | -P 1 |
Residual factor for all reflections | 0.0852 |
Residual factor for significantly intense reflections | 0.0498 |
Weighted residual factors for significantly intense reflections | 0.1096 |
Weighted residual factors for all reflections included in the refinement | 0.1149 |
Goodness-of-fit parameter for all reflections included in the refinement | 1.013 |
Diffraction radiation probe | x-ray |
Diffraction radiation wavelength | 0.71073 Å |
Diffraction radiation type | MoKα |