Information card for entry 2243354
Chemical name |
5-(2<i>H</i>-1,3-Benzodioxol-5-yl)-<i>N</i>-cyclohexylpenta-2,4-dienamide |
Formula |
C18 H21 N O3 |
Calculated formula |
C18 H21 N O3 |
SMILES |
O=C(NC1CCCCC1)/C=C/C=C/c1ccc2OCOc2c1 |
Title of publication |
Syntheses and crystal structures of two piperine derivatives |
Authors of publication |
Ezawa, Toshinari; Inoue, Yutaka; Murata, Isamu; Suzuki, Mitsuaki; Takao, Koichi; Sugita, Yoshiaki; Kanamoto, Ikuo |
Journal of publication |
Acta Crystallographica Section E |
Year of publication |
2020 |
Journal volume |
76 |
Journal issue |
5 |
Pages of publication |
646 - 650 |
a |
11.4982 ± 0.0007 Å |
b |
5.0086 ± 0.0003 Å |
c |
26.724 ± 0.0016 Å |
α |
90° |
β |
97.683 ± 0.002° |
γ |
90° |
Cell volume |
1525.22 ± 0.16 Å3 |
Cell temperature |
90 ± 2 K |
Ambient diffraction temperature |
90 ± 2 K |
Number of distinct elements |
4 |
Space group number |
14 |
Hermann-Mauguin space group symbol |
P 1 21/c 1 |
Hall space group symbol |
-P 2ybc |
Residual factor for all reflections |
0.0578 |
Residual factor for significantly intense reflections |
0.0488 |
Weighted residual factors for significantly intense reflections |
0.1158 |
Weighted residual factors for all reflections included in the refinement |
0.1211 |
Goodness-of-fit parameter for all reflections included in the refinement |
1.067 |
Diffraction radiation wavelength |
0.71073 Å |
Diffraction radiation type |
MoKα |
Yes |
No |
Yes |