Information card for entry 2243358
Chemical name |
Ethyl 2-[(4-oxo-3-phenyl-3,4-dihydroquinazolin-2-yl)sulfanyl]acetate |
Formula |
C18 H16 N2 O3 S |
Calculated formula |
C18 H16 N2 O3 S |
Title of publication |
Synthesis and structure of ethyl 2-[(4-oxo-3-phenyl-3,4-dihydroquinazolin-2-yl)sulfanyl]acetate |
Authors of publication |
Nguyen Tien, Cong; Nguyen Tan, Quang; Pham Duc, Dung; Tran Hoang, Phuong; Nguyen Dang, Dat; Truong Minh, Luong; Van Meervelt, Luc |
Journal of publication |
Acta Crystallographica Section E |
Year of publication |
2020 |
Journal volume |
76 |
Journal issue |
5 |
Pages of publication |
668 - 672 |
a |
11.8865 ± 0.0006 Å |
b |
5.1298 ± 0.0003 Å |
c |
28.2942 ± 0.0014 Å |
α |
90° |
β |
93.667 ± 0.004° |
γ |
90° |
Cell volume |
1721.72 ± 0.16 Å3 |
Cell temperature |
293 ± 2 K |
Ambient diffraction temperature |
293 ± 2 K |
Number of distinct elements |
5 |
Space group number |
14 |
Hermann-Mauguin space group symbol |
P 1 21/n 1 |
Hall space group symbol |
-P 2yn |
Residual factor for all reflections |
0.053 |
Residual factor for significantly intense reflections |
0.043 |
Weighted residual factors for significantly intense reflections |
0.1032 |
Weighted residual factors for all reflections included in the refinement |
0.1105 |
Goodness-of-fit parameter for all reflections included in the refinement |
1.075 |
Diffraction radiation probe |
x-ray |
Diffraction radiation wavelength |
0.71073 Å |
Diffraction radiation type |
MoKα |
Yes |
Yes |
Yes |