Information card for entry 2243365
Structure factors | 2243365.hkl |
Original IUCr paper | HTML |
Chemical name | 3-[5-(4-Chlorophenoxy)-3-methyl-1-phenyl-1<i>H</i>-pyrazol-4-yl]-1-[4-(prop-2-yn-1-yloxy)phenyl]prop-2-en-1-one |
Formula | C28 H21 Cl N2 O3 |
Calculated formula | C28 H21 Cl N2 O3 |
SMILES | C(=O)(/C=C/c1c(nn(c1Oc1ccc(Cl)cc1)c1ccccc1)C)c1ccc(cc1)OCC#C |
Title of publication | Functionalized 3-(5-aryloxy-3-methyl-1-phenyl-1<i>H</i>-pyrazol-4-yl)-1-(4-substituted-phenyl)prop-2-en-1-ones: synthetic pathway, and the structures of six examples |
Authors of publication | Kiran Kumar, Haruvegowda; Yathirajan, Hemmige S.; Asma; Manju, Nagaraja; Kalluraya, Balakrishna; Rathore, Ravindranath S.; Glidewell, Christopher |
Journal of publication | Acta Crystallographica Section E |
Year of publication | 2020 |
Journal volume | 76 |
Journal issue | 5 |
Pages of publication | 683 - 691 |
a | 8.9959 ± 0.0014 Å |
b | 9.738 ± 0.0015 Å |
c | 13.637 ± 0.002 Å |
α | 95.901 ± 0.004° |
β | 94.122 ± 0.004° |
γ | 95.959 ± 0.004° |
Cell volume | 1177.8 ± 0.3 Å3 |
Cell temperature | 297 ± 2 K |
Ambient diffraction temperature | 297 ± 2 K |
Number of distinct elements | 5 |
Space group number | 2 |
Hermann-Mauguin space group symbol | P -1 |
Hall space group symbol | -P 1 |
Residual factor for all reflections | 0.064 |
Residual factor for significantly intense reflections | 0.0481 |
Weighted residual factors for significantly intense reflections | 0.1096 |
Weighted residual factors for all reflections included in the refinement | 0.1249 |
Goodness-of-fit parameter for all reflections included in the refinement | 1.15 |
Diffraction radiation wavelength | 0.71073 Å |
Diffraction radiation type | MoKα |