Information card for entry 2243462
Structure factors | 2243462.hkl |
Original IUCr paper | HTML |
Chemical name | 3-(Furan-2-yl)-4-(4-methoxyphenyl)-1-(3,4,5-trimethoxyphenyl)azetidin-2-one |
Formula | C23 H23 N O6 |
Calculated formula | C23 H23 N O6 |
SMILES | C1(=O)[C@@H]([C@@H](c2ccc(cc2)OC)N1c1cc(c(c(c1)OC)OC)OC)c1ccco1.C1(=O)[C@H]([C@H](c2ccc(cc2)OC)N1c1cc(c(c(c1)OC)OC)OC)c1ccco1 |
Title of publication | Azetidin-2-ones: structures of antimitotic compounds based on the 1-(3,4,5-trimethoxyphenyl)azetidin-2-one core |
Authors of publication | Twamley, Brendan; O'Boyle, Niamh M.; Meegan, Mary J. |
Journal of publication | Acta Crystallographica Section E |
Year of publication | 2020 |
Journal volume | 76 |
Journal issue | 8 |
Pages of publication | 1187 - 1194 |
a | 19.794 ± 0.002 Å |
b | 9.1396 ± 0.0009 Å |
c | 23.161 ± 0.002 Å |
α | 90° |
β | 101.071 ± 0.0018° |
γ | 90° |
Cell volume | 4112.1 ± 0.7 Å3 |
Cell temperature | 100 ± 2 K |
Ambient diffraction temperature | 100 ± 2 K |
Number of distinct elements | 4 |
Space group number | 14 |
Hermann-Mauguin space group symbol | P 1 21/c 1 |
Hall space group symbol | -P 2ybc |
Residual factor for all reflections | 0.0852 |
Residual factor for significantly intense reflections | 0.0562 |
Weighted residual factors for significantly intense reflections | 0.103 |
Weighted residual factors for all reflections included in the refinement | 0.1119 |
Goodness-of-fit parameter for all reflections included in the refinement | 1.079 |
Diffraction radiation probe | x-ray |
Diffraction radiation wavelength | 0.71073 Å |
Diffraction radiation type | MoKα |