Information card for entry 2243493
Structure factors | 2243493.hkl |
Original IUCr paper | HTML |
Chemical name | 4-Oxatetracyclo[5.3.2.0^2,6^.0^8,10^]dodec-11-ene-3,5-dione |
Formula | C11 H10 O3 |
Calculated formula | C11 H10 O3 |
SMILES | O=C1OC(=O)[C@H]2[C@@H]1[C@H]1C=C[C@@H]2[C@H]2[C@@H]1C2 |
Title of publication | Syntheses and crystal structures of the anhydride 4-oxatetracyclo[5.3.2.0^2,6^.0^8,10^]dodec-11-ene-3,5-dione and the related imide 4-(4-bromophenyl)-4-azatetracyclo[5.3.2.0^2,6^.0^8,10^]dodec-11-ene-3,5-dione |
Authors of publication | Hulsman, Andrew; Lorenzana, Isabel; Schultz, Theodore; Squires, Breezy; Stenfors, Brock A.; Tolonen, Mason; Staples, Richard J.; Biros, Shannon M.; Winchester, William R. |
Journal of publication | Acta Crystallographica Section E |
Year of publication | 2020 |
Journal volume | 76 |
Journal issue | 8 |
Pages of publication | 1311 - 1315 |
a | 11.3538 ± 0.0003 Å |
b | 7.4062 ± 0.0002 Å |
c | 20.5398 ± 0.0005 Å |
α | 90° |
β | 92.6226 ± 0.0015° |
γ | 90° |
Cell volume | 1725.35 ± 0.08 Å3 |
Cell temperature | 173 ± 2 K |
Ambient diffraction temperature | 173 K |
Number of distinct elements | 3 |
Space group number | 14 |
Hermann-Mauguin space group symbol | P 1 21/n 1 |
Hall space group symbol | -P 2yn |
Residual factor for all reflections | 0.0482 |
Residual factor for significantly intense reflections | 0.0452 |
Weighted residual factors for significantly intense reflections | 0.1136 |
Weighted residual factors for all reflections included in the refinement | 0.1163 |
Goodness-of-fit parameter for all reflections included in the refinement | 1.059 |
Diffraction radiation wavelength | 1.54178 Å |
Diffraction radiation type | CuKα |