Information card for entry 2243525
Original IUCr paper | HTML |
Chemical name | Tetracopper cobalt digermanium heptasulfide |
Formula | Co Cu4 Ge2 S7 |
Calculated formula | Co Cu4 Ge2 S7 |
Title of publication | Syntheses and crystal structures of the quaternary thiogermanates Cu~4~FeGe~2~S~7~ and Cu~4~CoGe~2~S~7~ |
Authors of publication | Craig, Andrew J.; Stoyko, Stanislav S.; Bonnoni, Allyson; Aitken, Jennifer A. |
Journal of publication | Acta Crystallographica Section E |
Year of publication | 2020 |
Journal volume | 76 |
Journal issue | 7 |
Pages of publication | 1117 - 1121 |
a | 11.728 ± 0.0002 Å |
b | 5.33987 ± 0.0001 Å |
c | 8.33133 ± 0.00014 Å |
α | 90° |
β | 98.668 ± 0.0012° |
γ | 90° |
Cell volume | 515.798 ± 0.016 Å3 |
Cell temperature | 296 ± 2 K |
Ambient diffraction temperature | 296 ± 2 K |
Number of distinct elements | 4 |
Space group number | 5 |
Hermann-Mauguin space group symbol | C 1 2 1 |
Hall space group symbol | C 2y |
Residual factor for all reflections | 0.0348 |
Residual factor for significantly intense reflections | 0.0298 |
Weighted residual factors for significantly intense reflections | 0.0713 |
Weighted residual factors for all reflections included in the refinement | 0.0746 |
Goodness-of-fit parameter for all reflections included in the refinement | 1.111 |
Diffraction radiation wavelength | 0.71073 Å |
Diffraction radiation type | MoKα |