Information card for entry 2243535
Structure factors | 2243535.hkl |
Original IUCr paper | HTML |
Chemical name | (<i>R</i>~p~,<i>R</i>~p~)-Bis{2-[(dimethylamino)methyl]ferrocenyl}dimethylsilane |
Formula | C28 H38 Fe2 N2 Si |
Calculated formula | C28 H38 Fe2 N2 Si |
SMILES | [Fe]12345678([cH]9[cH]4[cH]3[cH]2[cH]19)[cH]1[cH]5[cH]6[c]7([c]81[Si](C)(C)[c]12[c]3([Fe]4567891([cH]2[cH]4[cH]35)[cH]1[cH]9[cH]8[cH]7[cH]61)CN(C)C)CN(C)C |
Title of publication | Crystal structures of [(<i>N</i>,<i>N</i>-dimethylamino)methyl]ferrocene and (<i>R</i>~p~,<i>R</i>~p~)-bis{2-[(dimethylamino)methyl]ferrocenyl}dimethylsilane |
Authors of publication | Krupp, Anna; Wegge, Jessica; Otte, Felix; Kleinheider, Johannes; Wall, Helene; Strohmann, Carsten |
Journal of publication | Acta Crystallographica Section E |
Year of publication | 2020 |
Journal volume | 76 |
Journal issue | 9 |
Pages of publication | 1437 - 1441 |
a | 12.0132 ± 0.0007 Å |
b | 14.0683 ± 0.0008 Å |
c | 15.7169 ± 0.0011 Å |
α | 90° |
β | 90° |
γ | 90° |
Cell volume | 2656.2 ± 0.3 Å3 |
Cell temperature | 100 K |
Ambient diffraction temperature | 100 K |
Number of distinct elements | 5 |
Space group number | 19 |
Hermann-Mauguin space group symbol | P 21 21 21 |
Hall space group symbol | P 2ac 2ab |
Residual factor for all reflections | 0.0303 |
Residual factor for significantly intense reflections | 0.0277 |
Weighted residual factors for significantly intense reflections | 0.0624 |
Weighted residual factors for all reflections included in the refinement | 0.0646 |
Goodness-of-fit parameter for all reflections included in the refinement | 1.07 |
Diffraction radiation probe | x-ray |
Diffraction radiation wavelength | 1.54178 Å |
Diffraction radiation type | CuKα |