Information card for entry 2243636
Structure factors | 2243636.hkl |
Original IUCr paper | HTML |
Chemical name | Triaqua[2,6-diacetylpyridine bis(benzoylhydrazone)]methanoldysprosium(III) trichloride methanol disolvate |
Formula | C26 H39 Cl3 Dy N5 O8 |
Calculated formula | C26 H39 Cl3 Dy N5 O8 |
SMILES | C1(c2ccccc2)N[N]2=C(C)c3cccc4C(=[N]5[Dy]2([n]34)([O]=1)([O]=C(c1ccccc1)N5)([OH]C)([OH2])([OH2])[OH2])C.CO.CO.[Cl-].[Cl-].[Cl-] |
Title of publication | Crystal structures of two isotypic lanthanide(III) complexes: triaqua[2,6-diacetylpyridine bis(benzoylhydrazone)]methanollanthanide(III) trichloride methanol disolvates (<i>Ln</i>^III^ = Tb and Dy) |
Authors of publication | Kachi-Terajima, Chihiro; Kimura, Norihisa |
Journal of publication | Acta Crystallographica Section E |
Year of publication | 2018 |
Journal volume | 74 |
Journal issue | 4 |
Pages of publication | 535 - 538 |
a | 8.9852 ± 0.0007 Å |
b | 12.6242 ± 0.001 Å |
c | 14.3887 ± 0.0012 Å |
α | 87.062 ± 0.001° |
β | 88.81 ± 0.001° |
γ | 82.068 ± 0.001° |
Cell volume | 1614.2 ± 0.2 Å3 |
Cell temperature | 100 K |
Ambient diffraction temperature | 100 K |
Number of distinct elements | 6 |
Space group number | 2 |
Hermann-Mauguin space group symbol | P -1 |
Hall space group symbol | -P 1 |
Residual factor for all reflections | 0.0349 |
Residual factor for significantly intense reflections | 0.0301 |
Weighted residual factors for significantly intense reflections | 0.0709 |
Weighted residual factors for all reflections included in the refinement | 0.0728 |
Goodness-of-fit parameter for all reflections included in the refinement | 1.039 |
Diffraction radiation wavelength | 0.71073 Å |
Diffraction radiation type | MoKα |