Information card for entry 2243646
Structure factors | 2243646.hkl |
Original IUCr paper | HTML |
Chemical name | 4-(2-Methoxyphenyl)piperazin-1-ium 4-iodobenzoate |
Formula | C18 H21 I N2 O3 |
Calculated formula | C18 H21 I N2 O3 |
SMILES | [NH2+]1CCN(CC1)c1c(cccc1)OC.c1(ccc(I)cc1)C(=O)[O-] |
Title of publication | Fifteen 4-(2-methoxyphenyl)piperazin-1-ium salts containing organic anions: supramolecular assembly in zero, one, two and three dimensions |
Authors of publication | Harish Chinthal, Chayanna; Kavitha, Channappa N.; Yathirajan, Hemmige S.; Foro, Sabine; Rathore, Ravindranath S.; Glidewell, Christopher |
Journal of publication | Acta Crystallographica Section E |
Year of publication | 2020 |
Journal volume | 76 |
Journal issue | 11 |
Pages of publication | 1779 - 1793 |
a | 7.1129 ± 0.0004 Å |
b | 11.2722 ± 0.0007 Å |
c | 12.5923 ± 0.0008 Å |
α | 69.852 ± 0.005° |
β | 74.681 ± 0.005° |
γ | 79.121 ± 0.005° |
Cell volume | 908.82 ± 0.1 Å3 |
Cell temperature | 296 ± 2 K |
Ambient diffraction temperature | 296 ± 2 K |
Number of distinct elements | 5 |
Space group number | 2 |
Hermann-Mauguin space group symbol | P -1 |
Hall space group symbol | -P 1 |
Residual factor for all reflections | 0.0347 |
Residual factor for significantly intense reflections | 0.0256 |
Weighted residual factors for significantly intense reflections | 0.0609 |
Weighted residual factors for all reflections included in the refinement | 0.0647 |
Goodness-of-fit parameter for all reflections included in the refinement | 1.02 |
Diffraction radiation wavelength | 0.71073 Å |
Diffraction radiation type | MoKα |