Information card for entry 2243648
Structure factors | 2243648.hkl |
Original IUCr paper | HTML |
Chemical name | 4-(2-Methoxyphenyl)piperazin-1-ium 2-chlorobenzoate |
Formula | C18 H21 Cl N2 O3 |
Calculated formula | C18 H21 Cl N2 O3 |
SMILES | [NH2+]1CCN(CC1)c1c(cccc1)OC.c1(c(Cl)cccc1)C(=O)[O-] |
Title of publication | Fifteen 4-(2-methoxyphenyl)piperazin-1-ium salts containing organic anions: supramolecular assembly in zero, one, two and three dimensions |
Authors of publication | Harish Chinthal, Chayanna; Kavitha, Channappa N.; Yathirajan, Hemmige S.; Foro, Sabine; Rathore, Ravindranath S.; Glidewell, Christopher |
Journal of publication | Acta Crystallographica Section E |
Year of publication | 2020 |
Journal volume | 76 |
Journal issue | 11 |
Pages of publication | 1779 - 1793 |
a | 7.9974 ± 0.0008 Å |
b | 27.611 ± 0.002 Å |
c | 8.5972 ± 0.0009 Å |
α | 90° |
β | 106.4 ± 0.01° |
γ | 90° |
Cell volume | 1821.2 ± 0.3 Å3 |
Cell temperature | 296 ± 2 K |
Ambient diffraction temperature | 296 ± 2 K |
Number of distinct elements | 5 |
Space group number | 14 |
Hermann-Mauguin space group symbol | P 1 21/c 1 |
Hall space group symbol | -P 2ybc |
Residual factor for all reflections | 0.1082 |
Residual factor for significantly intense reflections | 0.067 |
Weighted residual factors for significantly intense reflections | 0.1885 |
Weighted residual factors for all reflections included in the refinement | 0.2161 |
Goodness-of-fit parameter for all reflections included in the refinement | 1.031 |
Diffraction radiation wavelength | 0.71073 Å |
Diffraction radiation type | MoKα |