Information card for entry 2243651
Structure factors | 2243651.hkl |
Original IUCr paper | HTML |
Chemical name | 4-(2-Methoxyphenyl)piperazin-1-ium 2-methylbenzoate |
Formula | C19 H24 N2 O3 |
Calculated formula | C19 H24 N2 O3 |
SMILES | [NH2+]1CCN(CC1)c1c(cccc1)OC.c1(c(cccc1)C)C(=O)[O-] |
Title of publication | Fifteen 4-(2-methoxyphenyl)piperazin-1-ium salts containing organic anions: supramolecular assembly in zero, one, two and three dimensions |
Authors of publication | Harish Chinthal, Chayanna; Kavitha, Channappa N.; Yathirajan, Hemmige S.; Foro, Sabine; Rathore, Ravindranath S.; Glidewell, Christopher |
Journal of publication | Acta Crystallographica Section E |
Year of publication | 2020 |
Journal volume | 76 |
Journal issue | 11 |
Pages of publication | 1779 - 1793 |
a | 7.826 ± 0.001 Å |
b | 10.32 ± 0.002 Å |
c | 12.055 ± 0.003 Å |
α | 78.37 ± 0.02° |
β | 78.27 ± 0.02° |
γ | 73.83 ± 0.02° |
Cell volume | 904.6 ± 0.3 Å3 |
Cell temperature | 296 ± 2 K |
Ambient diffraction temperature | 296 ± 2 K |
Number of distinct elements | 4 |
Space group number | 2 |
Hermann-Mauguin space group symbol | P -1 |
Hall space group symbol | -P 1 |
Residual factor for all reflections | 0.0674 |
Residual factor for significantly intense reflections | 0.0418 |
Weighted residual factors for significantly intense reflections | 0.1082 |
Weighted residual factors for all reflections included in the refinement | 0.1193 |
Goodness-of-fit parameter for all reflections included in the refinement | 1.062 |
Diffraction radiation wavelength | 0.71073 Å |
Diffraction radiation type | MoKα |