Information card for entry 2243653
Structure factors | 2243653.hkl |
Original IUCr paper | HTML |
Chemical name | 4-(2-Methoxyphenyl)piperazin-1-ium 4-nitrobenzoate |
Formula | C18 H21 N3 O5 |
Calculated formula | C18 H21 N3 O5 |
SMILES | [NH2+]1CCN(CC1)c1c(cccc1)OC.c1(ccc(cc1)N(=O)=O)C(=O)[O-] |
Title of publication | Fifteen 4-(2-methoxyphenyl)piperazin-1-ium salts containing organic anions: supramolecular assembly in zero, one, two and three dimensions |
Authors of publication | Harish Chinthal, Chayanna; Kavitha, Channappa N.; Yathirajan, Hemmige S.; Foro, Sabine; Rathore, Ravindranath S.; Glidewell, Christopher |
Journal of publication | Acta Crystallographica Section E |
Year of publication | 2020 |
Journal volume | 76 |
Journal issue | 11 |
Pages of publication | 1779 - 1793 |
a | 7.5174 ± 0.0005 Å |
b | 7.9761 ± 0.0005 Å |
c | 29.86 ± 0.002 Å |
α | 90° |
β | 97.322 ± 0.006° |
γ | 90° |
Cell volume | 1775.8 ± 0.2 Å3 |
Cell temperature | 296 ± 2 K |
Ambient diffraction temperature | 296 ± 2 K |
Number of distinct elements | 4 |
Space group number | 14 |
Hermann-Mauguin space group symbol | P 1 21/c 1 |
Hall space group symbol | -P 2ybc |
Residual factor for all reflections | 0.0602 |
Residual factor for significantly intense reflections | 0.0404 |
Weighted residual factors for significantly intense reflections | 0.1025 |
Weighted residual factors for all reflections included in the refinement | 0.1112 |
Goodness-of-fit parameter for all reflections included in the refinement | 1.031 |
Diffraction radiation wavelength | 0.71073 Å |
Diffraction radiation type | MoKα |