Information card for entry 2243733
Chemical name |
1,1-Dibutyl-1<i>H</i>,3<i>H</i>-naphtho[1,8-<i>cd</i>][1,2,6]oxastannaborinin-3-ol |
Formula |
C18 H25 B O2 Sn |
Calculated formula |
C18 H25 B O2 Sn |
Title of publication |
Crystal structure of a 1,1-dibutyl-1<i>H</i>,3<i>H</i>-naphtho[1,8-<i>cd</i>][1,2,6]oxastannaborinin-3-ol |
Authors of publication |
Breitwieser, Kevin; Chen, Peter |
Journal of publication |
Acta Crystallographica Section E |
Year of publication |
2021 |
Journal volume |
77 |
Journal issue |
2 |
Pages of publication |
180 - 183 |
a |
30.1386 ± 0.0006 Å |
b |
11.2948 ± 0.0001 Å |
c |
16.4726 ± 0.0003 Å |
α |
90° |
β |
139.457 ± 0.004° |
γ |
90° |
Cell volume |
3644.9 ± 0.3 Å3 |
Cell temperature |
200 ± 0.1 K |
Ambient diffraction temperature |
200 ± 0.1 K |
Number of distinct elements |
5 |
Space group number |
15 |
Hermann-Mauguin space group symbol |
C 1 2/c 1 |
Hall space group symbol |
-C 2yc |
Residual factor for all reflections |
0.0247 |
Residual factor for significantly intense reflections |
0.0237 |
Weighted residual factors for significantly intense reflections |
0.0651 |
Weighted residual factors for all reflections included in the refinement |
0.0659 |
Goodness-of-fit parameter for all reflections included in the refinement |
1.08 |
Diffraction radiation wavelength |
1.54184 Å |
Diffraction radiation type |
CuKα |
Yes |
Yes |
Yes |