Information card for entry 2243760
Structure factors | 2243760.hkl |
Original IUCr paper | HTML |
Chemical name | Poly[[bis[μ~4~-<i>N</i>,<i>N</i>'-(1,3,5-oxadiazinane-3,5-diyl)bis(carbamoylmethanoato)]nickel(II)tetrapotassium] 4.8-hydrate] |
Formula | C14 H21.61 K4 N8 Ni2 O18.81 |
Calculated formula | C14 H21.61 K4 N8 Ni2 O18.805 |
Title of publication | Crystal structure and Hirshfeld surface analysis of poly[[bis[μ~4~-<i>N</i>,<i>N</i>'-(1,3,5-oxadiazinane-3,5-diyl)bis(carbamoylmethanoato)]nickel(II)tetrapotassium] 4.8-hydrate] |
Authors of publication | Plutenko, Maksym O.; Haukka, Matti; Husak, Alina O.; Iskenderov, Turganbay S.; Mulloev, Nurullo U. |
Journal of publication | Acta Crystallographica Section E |
Year of publication | 2021 |
Journal volume | 77 |
Journal issue | 3 |
Pages of publication | 298 - 304 |
a | 15.0694 ± 0.0003 Å |
b | 16.9659 ± 0.0003 Å |
c | 22.192 ± 0.0004 Å |
α | 90° |
β | 90° |
γ | 90° |
Cell volume | 5673.74 ± 0.18 Å3 |
Cell temperature | 100 ± 2 K |
Ambient diffraction temperature | 100 ± 2 K |
Number of distinct elements | 6 |
Space group number | 61 |
Hermann-Mauguin space group symbol | P b c a |
Hall space group symbol | -P 2ac 2ab |
Residual factor for all reflections | 0.0404 |
Residual factor for significantly intense reflections | 0.0334 |
Weighted residual factors for significantly intense reflections | 0.0722 |
Weighted residual factors for all reflections included in the refinement | 0.0762 |
Goodness-of-fit parameter for all reflections included in the refinement | 1.101 |
Diffraction radiation wavelength | 0.71073 Å |
Diffraction radiation type | MoKα |