Information card for entry 2243814
Structure factors | 2243814.hkl |
Original IUCr paper | HTML |
Chemical name | (<i>E</i>)-2-Amino-4-methylsulfanyl-6-oxo-1-[1-(pyridin-2-yl)ethylideneamino]-1,6-dihydropyrimidine-5-carbonitrile |
Formula | C13 H12 N6 O S |
Calculated formula | C13 H12 N6 O S |
SMILES | n1(/N=C(C)/c2ncccc2)c(N)nc(SC)c(c1=O)C#N |
Title of publication | Crystal structures of (<i>E</i>)-2-amino-4-methylsulfanyl-6-oxo-1-(1-phenylethylideneamino)-1,6-dihydropyrimidine-5-carbonitrile and (<i>E</i>)-2-amino-4-methylsulfanyl-6-oxo-1-[1-(pyridin-2-yl)ethylideneamino]-1,6-dihydropyrimidine-5-carbonitrile |
Authors of publication | Mohamed-Ezzat, Reham A.; Elgemeie, Galal H.; Jones, Peter G. |
Journal of publication | Acta Crystallographica Section E |
Year of publication | 2021 |
Journal volume | 77 |
Journal issue | 5 |
Pages of publication | 547 - 550 |
a | 13.4774 ± 0.0005 Å |
b | 7.6797 ± 0.0003 Å |
c | 14.2755 ± 0.0006 Å |
α | 90° |
β | 112.401 ± 0.005° |
γ | 90° |
Cell volume | 1366.05 ± 0.11 Å3 |
Cell temperature | 100 ± 2 K |
Ambient diffraction temperature | 100 ± 2 K |
Number of distinct elements | 5 |
Space group number | 14 |
Hermann-Mauguin space group symbol | P 1 21/n 1 |
Hall space group symbol | -P 2yn |
Residual factor for all reflections | 0.0371 |
Residual factor for significantly intense reflections | 0.0361 |
Weighted residual factors for significantly intense reflections | 0.0961 |
Weighted residual factors for all reflections included in the refinement | 0.097 |
Goodness-of-fit parameter for all reflections included in the refinement | 1.066 |
Diffraction radiation wavelength | 1.54184 Å |
Diffraction radiation type | CuKα |