Information card for entry 2310228
Formula |
Ho Pt3 |
Calculated formula |
Ho Pt3 |
Title of publication |
Some new intermetallic compounds of holmium and erbium with Ag, Au, Pt, Al, In, Tl, and Ge |
Authors of publication |
Moriarty, J.L.; Gordon, R.O.; Humphreys, J.E. |
Journal of publication |
Acta Crystallographica (1,1948-23,1967) |
Year of publication |
1965 |
Journal volume |
19 |
Pages of publication |
285 - 286 |
a |
4.058 Å |
b |
4.058 Å |
c |
4.058 Å |
α |
90° |
β |
90° |
γ |
90° |
Cell volume |
66.825 Å3 |
Number of distinct elements |
2 |
Space group number |
221 |
Hermann-Mauguin space group symbol |
P m -3 m |
Hall space group symbol |
-P 4 2 3 |
Yes |
No |
No |