Information card for entry 2311638
Common name | '2-(1-(4-(trifluoromethyl)phenyl)-1H-1,2,3-triazol-4-yl)pyridine' |
Formula | C14 H9 F3 N4 |
Calculated formula | C14 H9 F3 N4 |
Title of publication | Comparison of the structural motifs and packing arrangements of six novel derivatives and one polymorph of 2-(1-phenyl-1H-1,2,3-triazol-4-yl)pyridine. |
Authors of publication | Tawfiq, Kinaan M.; Miller, Gary J.; Al-Jeboori, Mohamad J; Fennell, Paul S.; Coles, Simon J.; Tizzard, Graham J.; Wilson, Claire; Potgieter, Herman |
Journal of publication | Acta crystallographica Section B, Structural science, crystal engineering and materials |
Year of publication | 2014 |
Journal volume | 70 |
Journal issue | Pt 2 |
Pages of publication | 379 - 389 |
a | 5.746 ± 0.0001 Å |
b | 7.2076 ± 0.0002 Å |
c | 15.2997 ± 0.0004 Å |
α | 103.045 ± 0.002° |
β | 98.768 ± 0.002° |
γ | 92.29 ± 0.002° |
Cell volume | 608.25 ± 0.03 Å3 |
Cell temperature | 120 ± 2 K |
Ambient diffraction temperature | 120 ± 2 K |
Number of distinct elements | 4 |
Space group number | 2 |
Hermann-Mauguin space group symbol | P -1 |
Hall space group symbol | -P 1 |
Residual factor for all reflections | 0.0459 |
Residual factor for significantly intense reflections | 0.0398 |
Weighted residual factors for significantly intense reflections | 0.1046 |
Weighted residual factors for all reflections included in the refinement | 0.1092 |
Goodness-of-fit parameter for all reflections included in the refinement | 1.028 |
Diffraction radiation wavelength | 0.71073 Å |
Diffraction radiation type | MoKα |