Information card for entry 2311645
Common name | NF mucate |
Formula | C41 H57 F2 N6 O21 |
Calculated formula | C41 H57 F2 N6 O21 |
Title of publication | Supramolecular structures and physicochemical properties of norfloxacin salts. |
Authors of publication | Xu, Yun; Jiang, Linglei; Mei, Xuefeng |
Journal of publication | Acta crystallographica Section B, Structural science, crystal engineering and materials |
Year of publication | 2014 |
Journal volume | 70 |
Journal issue | Pt 4 |
Pages of publication | 750 - 760 |
a | 7.4031 ± 0.0003 Å |
b | 9.7515 ± 0.0003 Å |
c | 30.9801 ± 0.001 Å |
α | 88.088 ± 0.002° |
β | 85.673 ± 0.002° |
γ | 81.38 ± 0.002° |
Cell volume | 2204.38 ± 0.13 Å3 |
Cell temperature | 100 ± 2 K |
Ambient diffraction temperature | 100 ± 2 K |
Number of distinct elements | 5 |
Space group number | 2 |
Hermann-Mauguin space group symbol | P -1 |
Hall space group symbol | -P 1 |
Residual factor for all reflections | 0.1207 |
Residual factor for significantly intense reflections | 0.0519 |
Weighted residual factors for significantly intense reflections | 0.1082 |
Weighted residual factors for all reflections included in the refinement | 0.1313 |
Goodness-of-fit parameter for all reflections included in the refinement | 0.997 |
Diffraction radiation wavelength | 0.71073 Å |
Diffraction radiation type | MoKα |